{"text_format":"1","workbook":"xlsx","n_sheets":12,"sheets":["Home","RFP Writing Guidelines","1.1. Purpose of RFP","1.2. Project Details","1.3. Schedule","2.1. General Format","2.2. Proposal Components","3.1 Evaluation Process","3.2 Evaluation Criteria","4. General Conditions","5. Attachments","Resources"],"not_rendered":{"charts":0,"images":2,"macros":1,"external_links":0,"defined_names":10,"comments":0,"pivot_tables":0},"unopened":[],"bounds":{"document_bytes":16777216,"sheet_cells":100000,"rows_first":2000,"rows_last":500,"rows_between":2000,"halvings":0,"cell_chars":16384,"cell_head_chars":4096},"cells_cut":0,"cells_raw":0,"read":"whole","date_system":"1900"}

{"sheet":"Home","index":0,"n_rows":14,"n_cols":2,"rows_kept":14,"cut":false,"hidden":false,"merged":[]}
[]
[]
[]
[null," I. Purpose of this Tool"]
[]
[]
[null," II. How to Use this Tool"]
[]
[]
[]
[null,"Legal Notice"]
[null,"This document and the associated guidelines are not intended to provide legal advice, which we recommend you seek on your own to ensure that the facts, circumstances, and state and local laws applicable to your procurement process are sufficiently addressed. "]
[]
[null,"Please direct all questions or comments to cityrenewablesaccelerator@rmi.org"]

{"sheet":"RFP Writing Guidelines","index":1,"n_rows":81,"n_cols":3,"rows_kept":81,"cut":false,"hidden":false,"merged":[[5,2,5,4]]}
[]
[null,"RFP Writing Guidelines"]
[]
[]
[]
[]
[]
[]
[]
[]
[null,null,"   Overview"]
[]
[]
[]
[]
{"$rows_left_out":67}
{"sheet":"1.1. Purpose of RFP","index":2,"n_rows":46,"n_cols":6,"rows_kept":46,"cut":false,"hidden":false,"merged":[[10,1,10,3],[32,1,32,3],[5,1,5,3]]}
[]
[null,"1. Project Overview > 1.1. Purpose of RFP",null,null,null,"This tab (1.1. Purpose of RFP) includes:"]
[null,null,null,null,null,"1.1.1. Introduction"]
[null,null,null,null,null,"          Outlines the RFP issuer's goals (i.e. describes who is requesting what)"]
[null,null,null,null,null,"1.1.2. Basic Eligibility"]
[null,null,null,null,null,"          Describes attributes of a desirable proposer"]
[]
[]
[]
[]
[null,"1.1.1 Introduction"]
[null,{"$f":"TRIM(F4)","v":"Outlines the RFP issuer's goals (i.e. describes who is requesting what)"}]
[]
[null,"Select a key word and click the \"Filter\" button:",null,"Key Words"]
[null,"Show all",{"$f":"\"     \" & VLOOKUP(B15, Resources!D2:E16, 2, 0)","v":"     Display all the example clauses in this section"},{"$f":"IF(B15=\"Show all\", \"*\", \"*\"&B15&\"*\")","v":"*"}]
{"$rows_left_out":32}
{"sheet":"1.2. Project Details","index":3,"n_rows":183,"n_cols":6,"rows_kept":183,"cut":false,"hidden":false,"merged":[[159,1,159,3],[140,1,140,3],[112,1,112,3],[96,1,96,3],[5,1,5,3],[12,1,12,3],[13,1,13,3],[113,1,113,3]]}
[]
[null,"1. Project Overview > 1.2. Project Details",null,null,null,"This tab (1.2. Project Details) includes:"]
[null,null,null,null,null,"1.2.1. Selected Proposer's Scope of Work"]
[null,null,null,null,null,"          Describes the work that a proposer should be prepared to perform"]
[null,null,null,null,null,"1.2.2. RFP Issuer's Scope of Work"]
[null,null,null,null,null,"          Describes how the RFP issuer will support the project "]
[null,null,null,null,null,"1.2.3. Contractual Agreement"]
[null,null,null,null,null,"          Describes any desired contractual agreements and terms"]
[null,null,null,null,null,"1.2.4. Project Siting"]
[null,null,null,null,null,"          Describes where the project should be located"]
[null,null,null,null,null,"1.2.5. Technical Requirements"]
[null,null,null,null,null,"          Describes any technical and equipment requirements"]
[null,"1.2.1. Selected Proposer's Scope of Work"]
[null,{"$f":"TRIM(F4)","v":"Describes the work that a proposer should be prepared to perform"}]
[]
{"$rows_left_out":169}
{"sheet":"1.3. Schedule","index":4,"n_rows":17,"n_cols":7,"rows_kept":17,"cut":false,"hidden":false,"merged":[[5,1,5,3],[6,1,6,3],[2,6,6,8],[1,6,1,8]]}
[]
[null,"1. Project Overview > 1.3. Schedule",null,null,null,null,"This tab (1.3. Schedule):"]
[null,null,null,null,null,null,"Provides a list of important dates, milestone events, and responsible parties"]
[]
[]
[]
[]
[]
[null,"Note: This tab has only one key word \"Schedule\""]
[]
[null,"Key Words","Example Clauses","Source"]
[null,"Schedule","Date/Time\tEvent\nXXXX XX, 20XX\tRFP issued\nIssue Date+2.5 weeks: Deadline for declaration of intent to participate\nIssue Date+3 weeks: Optional virtual site visit\nIssue Date+4.5 weeks: Deadline for submission of questions to the RFP \nIssue Date+5 weeks: Deadline for response to bidder questions to the RFP\nIssue Date+6 weeks: Deadline for submission of response to the RFP @ [time and time zone]\n\nMilestones\t\n   Due date: RFP responses due\n   Due date+3 weeks: Bidders notified of inclusion in short list\n….\t…..","Rocky Mountain Institute Shine Program"]
[null,"Schedule","The contract schedule represents the City's best estimate of the schedule that will be followed. If a component of this schedule is delayed, the rest of the schedule will be shifted accordingly. \nThe approximate contract schedule is as follows: \n\nIssue Request for Proposal: \tMay 2, 2017 \nSite Visit: \tMay 16, 2017 @ 10 AM\nPre-Proposal Meeting: \tMay 16, 2017 @ 1:30 PM \nFinal Date to Submit Written Questions: \tMay 26, 2017\nResponses to Questions Posted: \tMay 31, 2017 or Sooner \nProposals Due: \tJune 13, 2017 @ 5:00 PM \nNotification of Short-listed Developers: \tJune 2017 \nInterviews with short-listed Developers: \tJune 2017 \nContract Award: \tJuly 2017 \nServices Start Date: \tJuly 2017 ","City of Ames, IA"]
[null,"Schedule","Austin Energy will make a concerted effort to maintain the schedule below, but reserves the right to revise the schedule:\n\t\t\ta. Deadline for email questions will be 5:00 pm CT on March 28, 2014 RFP Issuance Date: February 24, 2014\n\t\t\tb. Mandatory site visits (proposer must attend one)- Tuesday, March 18, 2014 @ 10:00 a.m. or Wednesday, March 26, 2014 @ 10:00 a.m. The visit will be initiated at [address] and will proceed from there to the location of the generation facility. Attendees must provide their own transportation","City of Austin, TX"]
[null,"Schedule","Date / Time: Event\nAugust 05, 2016: RFP and RFQ issued\nAugust 12, 2016: Potential Financiers submit the form below\nAugust 12, 2016: Deadline for Bidders’ declaration of Intent to Participate \nAugust 12, 2016: Qualified capital providers introduced to Bidders\nAugust 24, 2016: Optional Pre-proposal virtual site visit\nAugust 29, 2016: Deadline for questions and clarifications \nSeptember 19, 2016: All RFP bids due\nOctober 07, 2016: End of initial evaluation period","Rochester"]
{"$rows_left_out":3}
{"sheet":"2.1. General Format","index":5,"n_rows":34,"n_cols":6,"rows_kept":34,"cut":false,"hidden":false,"merged":[[5,1,5,3],[2,5,6,7],[1,5,1,7]]}
[]
[null,"2. Proposal Requirements > 2.1. General Formats",null,null,null,"This tab (2.1. General Formats):"]
[null,null,null,null,null,"Summarizes RFP format requirements and how proposers can ask clarifying questions"]
[]
[]
[]
[]
[]
[null,"Select a key word and click the \"Filter\" button:",null,"Key Words"]
[null,"Show all",{"$f":"\"     \" & VLOOKUP(B10, Resources!D70:E78, 2, 0)","v":"     Display all the example clauses in this section"},{"$f":"IF(B10=\"Show all\", \"*\", \"*\"&B10&\"*\")","v":"*"}]
[]
[]
[null,"Key Words","Example Clauses","Source"]
[null,"Deadline","Questions and requests for clarification of requirements for these services are encouraged. All questions and requests for clarification to the RFP shall be received in writing no later than 5:00 p.m. local time on May 26, 2017. Questions and requests for clarification to be submitted via e-mail to [xxyyzz@buyer.com]","City of Ames, IA"]
[null,"Deadline; Proposer communication","All questions and clarifications should be directed to Buyer. Bidders will have the opportunity to ask questions through email to [xxyyzz@buyer.com] during the RFP process. Responses to answers will be provided to all bidders concurrently and posted online at website address. The identity of the bidder that submitted the question will be confidential.\n \nBuyer will not respond to questions received after question deadline date and time.\n \nBuyer will ask bidders to provide feedback to Buyer Information and Site-Specific Details, PPA pricing, Land Lease, Interconnect, and Winner’s Agreements. This will help Buyer understand bidder’s substantial concerns.","Rocky Mountain Institute Shine Program"]
{"$rows_left_out":20}
{"sheet":"2.2. Proposal Components","index":6,"n_rows":51,"n_cols":7,"rows_kept":51,"cut":false,"hidden":false,"merged":[[5,1,5,3],[6,1,6,3],[2,6,6,8],[1,6,1,8]]}
[]
[null,"2. Proposal Requirements > 2.2. Proposal Components",null,null,null,null,"This tab (2.2. Proposal Components):"]
[null,null,null,null,null,null,"Provides a list of materials proposers should submit"]
[]
[]
[]
[]
[]
[null,"Select a key word and click the \"Filter\" button:",null,"Key Words"]
[null,"Show all",{"$f":"\"     \" & VLOOKUP(B10, Resources!D79:E91, 2, 0)","v":"     Display all the example clauses in this section"},{"$f":"IF(B10=\"Show all\", \"*\", \"*\"&B10&\"*\")","v":"*"}]
[]
[]
[null,"Key Words","Example Clauses","Source"]
[null,"Construction","Provide a Project Management Plan and Gantt chart detailing critical pathways to project development, and major development milestones. The Project Management Plan should commence at the start of the construction and conclude with project commissioning and commercial operations. ","City of Ames, IA"]
[null,"Construction; O&M","Proposer must provide a) development plan to timely construct the facility with minimal environmental impact b) staffing and maintenance plan to support long-term operations.","City of Austin, TX"]
{"$rows_left_out":37}
{"sheet":"3.1 Evaluation Process","index":7,"n_rows":36,"n_cols":7,"rows_kept":36,"cut":false,"hidden":false,"merged":[[5,1,5,3],[2,6,6,7],[1,6,1,7]]}
[]
[null,"3. Proposal Evaluation > 3.1. Evaluation Process",null,null,null,null,"This tab (3.1. Evaluation Process):"]
[null,null,null,null,null,null,"Summarizes the steps included in the evaluation process"]
[]
[]
[]
[]
[]
[null,"Select a key word and click the \"Filter\" button:",null,"Key Words"]
[null,"Show all",{"$f":"\"     \" & VLOOKUP(B10, Resources!D92:E98, 2, 0)","v":"     Display all the example clauses in this section"},{"$f":"IF(B10=\"Show all\", \"*\", \"*\"&B10&\"*\")","v":"*"}]
[]
[]
[null,"Key Words","Example Clauses","Source"]
[null,"Criteria overview","Award shall be made to the Developer submitting the most responsible and responsive proposal which offers the greatest value to the City with criteria detailed and the scope of services set forth. ","City of Ames, IA"]
[null,"Criteria overview","Commission Staff will evaluate all proposals received for their completeness, clarity, quality of presentation, how well the project meets the goals of SB 129, RSA 362-F and the Renewable Energy Fund, reasonableness of costs, project feasibility and readiness, potential for long-term success of the project, qualifications and relevant experience of the project team, responses to all topics, and the likelihood of project completion within the contract period. The evaluation criteria combine both objective and subjective factors. ","State of New Hampshire Public Utilities Commission"]
{"$rows_left_out":22}
{"sheet":"3.2 Evaluation Criteria","index":8,"n_rows":31,"n_cols":7,"rows_kept":31,"cut":false,"hidden":false,"merged":[[5,1,5,3],[2,6,6,9],[1,6,1,9]]}
[]
[null,"3. Proposal Evaluation > 3.1. Evaluation Criteria",null,null,null,null,"This tab (3.2. Evaluation Criteria):"]
[null,null,null,null,null,null,"Provides and explains a list of criteria upon which the RFP issuer will score each proposal"]
[]
[]
[]
[]
[]
[null,"Select a key word and click the \"Filter\" button:",null,"Key Words"]
[null,"Show all",{"$f":"\"     \" & VLOOKUP(B10, Resources!D99:E105, 2, 0)","v":"     Display all the example clauses in this section"},{"$f":"IF(B10=\"Show all\", \"*\", \"*\"&B10&\"*\")","v":"*"}]
[]
[]
[null,"Key Words","Example Clauses","Source"]
[null,"Ability to deliver","Buyer will holistically evaluate bidders for ability to deliver. Buyer will evaluate bidders on the basis of experience and delivery method. ","Rocky Mountain Institute Shine Program"]
[null,"Ability to deliver","Annual production estimates; Annual performance guarantees; Performance history and reliability of the equipment specified for this project in similar environments; Strength and experience of the Developer’s project team and proven expertise of the project team \nbased on past project performance and references; Project schedule; Experience with building at or near airport location. ","City of Ames, IA"]
{"$rows_left_out":17}
{"sheet":"4. General Conditions","index":9,"n_rows":41,"n_cols":7,"rows_kept":41,"cut":false,"hidden":false,"merged":[[4,1,4,3],[2,6,10,9],[1,6,1,9]]}
[]
[null,"4. General Conditions",null,null,null,null,"This tab (4. General Conditions):"]
[null,null,null,null,null,null,"Specifies what conditions proposers should comply with"]
[]
[]
[]
[]
[null,"Select a key word and click the \"Filter\" button:",null,"Key Words"]
[null,"Show all",{"$f":"\"     \" & VLOOKUP(B9, Resources!D106:E113, 2, 0)","v":"     Display all the example clauses in this section"},{"$f":"IF(B9=\"Show all\", \"*\", \"*\"&B9&\"*\")","v":"*"}]
[]
[]
[null,"Key Words","Example Clauses","Source"]
[null,"Acknowledgement and acceptance of terms and conditions","The submission of a proposal shall constitute a bidder’s acknowledgement and acceptance of all terms, conditions, and requirements of this RFP. This includes terms specified in the main RFP document (sections 1 through 4 of this document) as well as all Appendix Documents including the power purchase agreement (PPA), Winner’s Agreement, Land Lease Agreement, and Interconnect Agreement. Bidders may submit comments on each of these Appendix Documents as part of the Final RFP Bidsheet. If a bidder has reasonable grounds to reject any terms or conditions, the bidder must identify problematic terms in the Final RFP Bidsheet. Inability to accept a term or condition will not necessarily disqualify a bidder.","Rocky Mountain Institute Shine Program"]
[null,"Acknowledgement and acceptance of terms and conditions","Proposers shall comply with the City of Austin’s Minority-Owned and Women-Owned Business Enterprise (MBE/WBE) Procurement Program (City Code Chapters 2-9A, 2-9B, 2-9C and 2-9D), Rules, and the Third Party Resolution (20120112-058) for the purchase, design and construction costs associated with the award and completion of the project.","City of Austin, TX"]
[null,"Acknowledgement and acceptance of terms and conditions","All Bidders are expected to conform with applicable New York State requirements vis-à-vis Remote Net Metering, Community Distributed Generation and the Operating Agreement with local utility service provider, MW Bloc Incentives, local wage rates, and others provided by the State of New York and its governing bodies. Bidders who fail to conform with those requirements will not be considered under this RFP.","ROCSPOT (RFP)"]
{"$rows_left_out":27}
{"sheet":"5. Attachments","index":10,"n_rows":15,"n_cols":7,"rows_kept":15,"cut":false,"hidden":false,"merged":[[4,1,4,3],[2,4,5,4]]}
[]
[null,"5. Attachments",null,null,"This tab (5. Attachments):"]
[null,null,null,null,"Provides examples of potential attachments to an RFP document"]
[]
[]
[]
[]
[null,"Attachment","Value","When to Include","Examples"]
[null,"Power purchase agreement","Specify contract length, pricing structure, and other PPA terms","If you will sign a PPA agreement at the end of the RFP","RMI Shine: PPA Template","Renewables Accelerator: Off-site Renewables PPA RFP Template","IREC: Solar Power Purchase Agreements - A Toolkit for Local Governments"]
[null,"Interconnection agreement","Delineate the rules, roles, and responsibilities surrounding the construction and physical connection of a distribution generation unit to the utility grid","When you are providing, or considering providing, land to a project or signing a PPA agreement","RMI Shine: Interconnection Agreement Template"]
[null,"Land lease agreement","Provide a legal agreement between the owner/operator of a distributed generation facility and the owner of the parcel of land selected to host a distributed generation facility.","If you are providing, or are considering providing, land to a project","RMI Shine: Land Lease Agreement Guidelines","University of Minnesota Law School: Guidelines to Community Solar Garden Leases","New York State Energy Research and Development Authority: RFP Land Lease Template"]
[null,"Winner's agreement","Ensure that: 1) the Buyer and the Developers understand their roles and commitments during the solar development process; 2) PPA, Lease, and Interconnection contracts are executed within a reasonable amount of time; and 3) Eventual contracts closely resemble contracts proposed during the RFP.","If you are sure you will sign a monetary contact as a result of the RFP","RMI Shine: Winner's Agreement Template","City and County of Denver, CO (1): Sample Master Service Agreement Template and CSG Subscription Template"]
[null,"Local government energy profile","Introduce the local government's energy use data and load profiles","If the project seeks to incorporate local design elements such as sizing to city subcriber needs, providing back up for critical assets, or supporting electric vehicle charging","The City of Philadelphia RFP Attachment: Energy Use Data and Load Profiles"]
[null,"RFP bid sheet","Provide a standard Excel-based bid sheet for proposers to fill out, which includes bidder information, project details, pricing, and production","If you want to receive consistent information from proposers, facilitate \"apples to apples\" proposal comparison, and reduce staff time required to evaluate and analyze proposals","Renewables Accelerator: RFP Bid Sheet Template","RMI Shine: RFP Bid Sheet Template"]
[null,"Diversity, equity and inclusion information request form","Provide proposers an opportunity to state whether they have a diversity and inclusiveness program for employment and retention, procurement and supply chain activities, or customer service","If you want to know proposers' diversity, equity and inclusion practices","City and County of Denver, CO: Diversity and Inclusiveness in City Solicitations - Information Request Form"]
{"$rows_left_out":1}
{"sheet":"Resources","index":11,"n_rows":113,"n_cols":6,"rows_kept":113,"cut":false,"hidden":false,"merged":[[3,5,8,8]]}
[null,"Section","Section Name","Key Words","Description"]
[null,"1.1.1","Introduction","Show all","Display all the example clauses in this section","This tab (Resources) includes:"]
[null,"1.1.1","Introduction","RFP issuer description","Who the RFP issuer is and what their motivations are"]
[null,"1.1.1","Introduction","Capacity","The project size ","A list of original RFPs that this tool cited in the previous tabs\n"]
[null,"1.1.1","Introduction","Diversity, equity & inclusion","Specific requirements regarding diversity, equity and inclusion"]
[null,"1.1.1","Introduction","Duration","The accepted range of the contract's length"]
[null,"1.1.1","Introduction","Location","Project/site location requirements"]
[null,"1.1.1","Introduction","Participation intention","How respondents should indicate their intent to participate"]
[null,"1.1.1","Introduction","Performance guarantee","What types of performance guarantees should be included in a proposal"]
[null,"1.1.1","Introduction","PPA","If and how a power purchase agreement will be used"]
[null,"1.1.1","Introduction","Price","What energy price information should be included in a proposal"]
[null,"1.1.1","Introduction","Production schedule","What types of production schedules should be included in a proposal"]
[null,"1.1.1","Introduction","Project costs","An estimation of the total project cost"]
[null,"1.1.1","Introduction","REC","Who will aquire the associated renewable energy certificates (RECs)"]
[null,"1.1.1","Introduction","Scope of work","The work that should be done as a result of this request"]
{"$rows_left_out":98}